Reaction Details
TargetToll-like receptor 7
LigandBDBM427896
Substrate/Competitorn/a
Meas. Tech.TLR7/8/9 Inhibition Reporter Assays
IC50 0.140±n/a nM
Citation Dyckman, AJDodd, DSMussari, CPSherwood, TCWhiteley, BKGilmore, JLKumar, SRPasunoori, LSrinivas, PVDuraisamy, SKHegde, SAnumula, RK 4-Azaindole compounds US Patent US10730877 Publication Date 8/4/2020
 
Toll-like receptor 7
Name:Toll-like receptor 7
Type:Enzyme
Mol. Mass.:120945.35
Organism:Homo sapiens (Human)
Description:Q9NYK1
Residue:1049
BDBM427896
NameBDBM427896
Synonyms:US10544143, Example 330 US10730877, Example 331 | US11053244, Example 331
TypeSmall organic molecule
Emp. Form.C28H36N6O2
Mol. Mass.488.6244
SMILESCOc1cc(cn2ncnc12)-c1[nH]c2cc(C)c(nc2c1C(C)C)C1CCC(CC1)N(C)C1COC1