Reaction Details
TargetToll-like receptor 7
LigandBDBM428604
Substrate/Competitorn/a
Meas. Tech.TLR7/8/9 Inhibition Reporter Assays
IC50 0.170±n/a nM
Citation Dyckman, AJDodd, DSMussari, CPSherwood, TCWhiteley, BKGilmore, JLKumar, SRPasunoori, LSrinivas, PVDuraisamy, SKHegde, SAnumula, RK 4-Azaindole compounds US Patent US10730877 Publication Date 8/4/2020
 
Toll-like receptor 7
Name:Toll-like receptor 7
Type:Enzyme
Mol. Mass.:120945.35
Organism:Homo sapiens (Human)
Description:Q9NYK1
Residue:1049
BDBM428604
NameBDBM428604
Synonyms:US10544143, Example 1040 US10730877, Example 1052 | US11053244, Example 1052
TypeSmall organic molecule
Emp. Form.C29H38N6
Mol. Mass.470.6522
SMILESCC(C)c1c([nH]c2ccc(nc12)C1CCC(CC1)N1CC(C)(C)C1)-c1cn2ncnc2c(C)c1C