Reaction Details
TargetToll-like receptor 7
LigandBDBM428633
Substrate/Competitorn/a
Meas. Tech.TLR7/8/9 Inhibition Reporter Assays
IC50 0.090±n/a nM
Citation Dyckman, AJDodd, DSMussari, CPSherwood, TCWhiteley, BKGilmore, JLKumar, SRPasunoori, LSrinivas, PVDuraisamy, SKHegde, SAnumula, RK 4-Azaindole compounds US Patent US10730877 Publication Date 8/4/2020
 
Toll-like receptor 7
Name:Toll-like receptor 7
Type:Enzyme
Mol. Mass.:120945.35
Organism:Homo sapiens (Human)
Description:Q9NYK1
Residue:1049
BDBM428633
NameBDBM428633
Synonyms:US10544143, Example 1069 US10730877, Example 1070 | US11053244, Example 1070
TypeSmall organic molecule
Emp. Form.C29H36N6O2
Mol. Mass.500.6351
SMILESCOc1cc(cn2ncnc12)-c1[nH]c2ccc(nc2c1C(C)C)C1CCC(CC1)N1CC2(C1)CCOC2