Reaction Details
TargetAP2-associated protein kinase 1
LigandBDBM311332
Substrate/Competitorn/a
Meas. Tech.Kinase Assay
IC50 0.490±n/a nM
Citation Luo, GDzierba, CDMacor, JE Biaryl kinase inhibitors US Patent US10723734 Publication Date 7/28/2020
 
AP2-associated protein kinase 1
Name:AP2-associated protein kinase 1
Type:PROTEIN
Mol. Mass.:103884.23
Organism:Homo sapiens (Human)
Description:ChEMBL_774569
Residue:961
BDBM311332
NameBDBM311332
Synonyms:(S)-N-(4-(4-((2-amino-4-methylpentyl)oxy)-3-fluorophenyl)pyridin-2-yl)acetamide US10155760, Example 189 | US9902722, Example 189
TypeSmall organic molecule
Emp. Form.C21H22ClF2N3O
Mol. Mass.405.869
SMILESCC(C)C[C@](C)(N)COc1ncc(cc1Cl)-c1ccnc2cc(F)cc(F)c12