Reaction Details
TargetMu-type opioid receptor
LigandBDBM179878
Substrate/Competitorn/a
Meas. Tech.Opioid Receptor Binding Assay
Ki 0.120±n/a nM
Citation Blumberg, LCDeaver, DREyerman, DJWynn, TA Methods for treating depressive symptoms US Patent US10736890 Publication Date 8/11/2020
 
Mu-type opioid receptor
Name:Mu-type opioid receptor
Type:G Protein-Coupled Receptor (GPCR)
Mol. Mass.:44789.51
Organism:Homo sapiens (Human)
Description:P35372
Residue:400
BDBM179878
NameBDBM179878
Synonyms:US10231963, Table B.24 US10736890, Compound TABLE B.24 US11534436, Compound Table B.24 US9656961, Example 00141
TypeSmall organic molecule
Emp. Form.C22H30N2O2
Mol. Mass.354.4858
SMILESNC(=O)c1ccc2C[C@@H]3[C@@H]4CCCC[C@]4(CCN3CC3CCC3)c2c1O