Reaction Details
TargetTyrosine-protein kinase Tec
LigandBDBM458161
Substrate/Competitorn/a
Meas. Tech.Kinase Inhibition Assay
IC50 1.26±n/a nM
Citation Laurent, AMorris, SJ Spirocyclic containing compounds and pharmaceutical uses thereof US Patent US10752615 Publication Date 8/25/2020
 
Tyrosine-protein kinase Tec
Name:Tyrosine-protein kinase Tec
Type:Protein
Mol. Mass.:73597.00
Organism:Homo sapiens (Human)
Description:n/a
Residue:631
BDBM458161
NameBDBM458161
Synonyms:US10752615, Compound 53
TypeSmall organic molecule
Emp. Form.C28H28N6O4S
Mol. Mass.544.625
SMILESCN(C(C)=O)c1ccc2n([C@H]3C[C@]4(C3)CCN(C4)C(=O)C=C)c(NC(=O)c3ccc(s3)-c3cnco3)nc2c1