Reaction Details
TargetTyrosine-protein kinase Tec
LigandBDBM50458600
Substrate/Competitorn/a
Meas. Tech.Kinase Inhibition Assay
IC50 0.090±n/a nM
Citation Laurent, AMorris, SJ Spirocyclic containing compounds and pharmaceutical uses thereof US Patent US10752615 Publication Date 8/25/2020
 
Tyrosine-protein kinase Tec
Name:Tyrosine-protein kinase Tec
Type:Protein
Mol. Mass.:73597.00
Organism:Homo sapiens (Human)
Description:n/a
Residue:631
BDBM50458600
NameBDBM50458600
Synonyms:CHEMBL4206765 | US10752615, Compound 97
TypeSmall organic molecule
Emp. Form.C27H25N5O3S
Mol. Mass.499.584
SMILESC=CC(=O)N1CC[C@@]2(C[C@@H](C2)n2c(NC(=O)c3ccc(s3)-c3cc[nH]c(=O)c3)nc3ccccc23)C1