Reaction Details
TargetGlucocorticoid receptor
LigandBDBM299271
Substrate/Competitorn/a
Meas. Tech.Receptor Binding Assay
Ki 0.800±n/a nM
Citation Weinstein, DSGong, HYang, MGXiao, Z Imide and acylurea derivatives as modulators of the glucocorticoid receptor US Patent US9593113 Publication Date 3/14/2017
 
Glucocorticoid receptor
Name:Glucocorticoid receptor
Type:Enzyme
Mol. Mass.:85656.87
Organism:Homo sapiens (Human)
Description:P04150
Residue:777
BDBM299271
NameBDBM299271
Synonyms:US9593113, Example 36
TypeSmall organic molecule
Emp. Form.C26H27N3O4
Mol. Mass.445.5103
SMILESCC(C)Oc1ccc(cc1)-c1ccc2[C@H](c3ccccc3Oc2n1)C(C)(C)C(=O)NC(N)=O