Reaction Details
TargetGlucocorticoid receptor
LigandBDBM50048345
Substrate/Competitorn/a
Meas. Tech.Receptor Binding Assay
Ki 1.97±n/a nM
Citation Weinstein, DSGong, HYang, MGXiao, Z Imide and acylurea derivatives as modulators of the glucocorticoid receptor US Patent US9593113 Publication Date 3/14/2017
 
Glucocorticoid receptor
Name:Glucocorticoid receptor
Type:Enzyme
Mol. Mass.:85656.87
Organism:Homo sapiens (Human)
Description:P04150
Residue:777
BDBM50048345
NameBDBM50048345
Synonyms:CHEMBL3315067 | US9593113, Example 46
TypeSmall organic molecule
Emp. Form.C27H26FN5O4
Mol. Mass.503.5248
SMILESCC(C)([C@@H]1c2ccc(nc2Oc2c(F)cccc12)-c1ccc(nc1)C(=O)N1CCCC1)C(=O)NC(N)=O