Reaction Details
TargetGlycogen synthase kinase-3 beta
LigandBDBM459181
Substrate/Competitorn/a
Meas. Tech.Kinase Assay
EC50 1.000±n/a nM
Citation K C, SKMittapalli, GKChiruta, CHofilena, BJ Indazole containing macrocycles and therapeutic uses thereof US Patent US10759799 Publication Date 9/1/2020
 
Glycogen synthase kinase-3 beta
Name:Glycogen synthase kinase-3 beta
Type:Enzyme
Mol. Mass.:46756.38
Organism:Homo sapiens (Human)
Description:P49841
Residue:420
BDBM459181
NameBDBM459181
Synonyms:US10759799, Compound 2
TypeSmall organic molecule
Emp. Form.C27H19N7O
Mol. Mass.457.4861
SMILESO=C1CCc2cccc(c2)-c2nccc3[nH]c(nc23)-c2n[nH]c3ccc(cc23)-c2cncc(N1)c2