Reaction Details
TargetGlycogen synthase kinase-3 beta
LigandBDBM459193
Substrate/Competitorn/a
Meas. Tech.Kinase Assay
EC50 1.000±n/a nM
Citation K C, SKMittapalli, GKChiruta, CHofilena, BJ Indazole containing macrocycles and therapeutic uses thereof US Patent US10759799 Publication Date 9/1/2020
 
Glycogen synthase kinase-3 beta
Name:Glycogen synthase kinase-3 beta
Type:Enzyme
Mol. Mass.:46756.38
Organism:Homo sapiens (Human)
Description:P49841
Residue:420
BDBM459193
NameBDBM459193
Synonyms:US10759799, Compound 45
TypeSmall organic molecule
Emp. Form.C25H22N10
Mol. Mass.462.5092
SMILESCN1CCCn2cc(nn2)-c2cncc3[nH]c(nc23)-c2n[nH]c3ccc(cc23)-c2cncc(C1)c2