Reaction Details
TargetMitogen-activated protein kinase kinase kinase kinase 4
LigandBDBM50011555
Substrate/Competitorn/a
Meas. Tech.MAP4K4 Inhibition Assay
IC50 415±n/a nM
Citation Chen, HCrawford, THarris, SFMagnuson, SRNdubaku, CWang, L Aminoquinazoline and pyridopyrimidine derivatives US Patent US9592235 Publication Date 3/14/2017
 
Mitogen-activated protein kinase kinase kinase kinase 4
Name:Mitogen-activated protein kinase kinase kinase kinase 4
Type:Serine/threonine-protein kinase
Mol. Mass.:142114.73
Organism:Homo sapiens (Human)
Description:O95819
Residue:1239
BDBM50011555
NameBDBM50011555
Synonyms:CHEMBL3262574 US9855269, Compound 5
TypeSmall organic molecule
Emp. Form.C15H13N3
Mol. Mass.235.2838
SMILESCc1cccc(c1)-c1ccc2ncnc(N)c2c1