Reaction Details
TargetMitogen-activated protein kinase kinase kinase kinase 4
LigandBDBM50011536
Substrate/Competitorn/a
Meas. Tech.MAP4K4 Inhibition Assay
IC50 11.8±n/a nM
Citation Chen, HCrawford, THarris, SFMagnuson, SRNdubaku, CWang, L Aminoquinazoline and pyridopyrimidine derivatives US Patent US9592235 Publication Date 3/14/2017
 
Mitogen-activated protein kinase kinase kinase kinase 4
Name:Mitogen-activated protein kinase kinase kinase kinase 4
Type:Serine/threonine-protein kinase
Mol. Mass.:142114.73
Organism:Homo sapiens (Human)
Description:O95819
Residue:1239
BDBM50011536
NameBDBM50011536
Synonyms:CHEMBL3262587 US9855269, Compound 28
TypeSmall organic molecule
Emp. Form.C13H9FN4
Mol. Mass.240.2358
SMILESNc1ncnc2ccc(nc12)-c1cccc(F)c1