Reaction Details
TargetMitogen-activated protein kinase kinase kinase kinase 4
LigandBDBM299411
Substrate/Competitorn/a
Meas. Tech.MAP4K4 Inhibition Assay
IC50 190±n/a nM
Citation Chen, HCrawford, THarris, SFMagnuson, SRNdubaku, CWang, L Aminoquinazoline and pyridopyrimidine derivatives US Patent US9592235 Publication Date 3/14/2017
 
Mitogen-activated protein kinase kinase kinase kinase 4
Name:Mitogen-activated protein kinase kinase kinase kinase 4
Type:Serine/threonine-protein kinase
Mol. Mass.:142114.73
Organism:Homo sapiens (Human)
Description:O95819
Residue:1239
BDBM299411
NameBDBM299411
Synonyms:6-(4-pyridyl) quinazolin- 4-amine US9855269, Compound 51
TypeSmall organic molecule
Emp. Form.C13H10N4
Mol. Mass.222.2453
SMILESNc1ncnc2ccc(cc12)-c1ccncc1