Reaction Details
TargetMitogen-activated protein kinase kinase kinase kinase 4
LigandBDBM299494
Substrate/Competitorn/a
Meas. Tech.MAP4K4 Inhibition Assay
IC50 157±n/a nM
Citation Chen, HCrawford, THarris, SFMagnuson, SRNdubaku, CWang, L Aminoquinazoline and pyridopyrimidine derivatives US Patent US9592235 Publication Date 3/14/2017
 
Mitogen-activated protein kinase kinase kinase kinase 4
Name:Mitogen-activated protein kinase kinase kinase kinase 4
Type:Serine/threonine-protein kinase
Mol. Mass.:142114.73
Organism:Homo sapiens (Human)
Description:O95819
Residue:1239
BDBM299494
NameBDBM299494
Synonyms:6-(3-ethoxy- phenyl) quinazolin- 4-amine US9855269, Compound 114
TypeSmall organic molecule
Emp. Form.C16H15N3O
Mol. Mass.265.3098
SMILESCCOc1cccc(c1)-c1ccc2ncnc(N)c2c1