Reaction Details
TargetDual specificity calcium/calmodulin-dependent 3',5'-cyclic nucleotide phosphodiesterase 1C
LigandBDBM279101
Substrate/Competitorn/a
Meas. Tech.Inhibition Assay
IC50 0.520±n/a nM
Citation Juhl, KJessing, MLanggård, MVital, PJKehler, JRasmussen, LKClementson, CMMarigo, M 1H-pyrazolo[4,3-b]pyridines as PDE1 inhibitors US Patent US10766893 Publication Date 9/8/2020
 
Dual specificity calcium/calmodulin-dependent 3',5'-cyclic nucleotide phosphodiesterase 1C
Name:Dual specificity calcium/calmodulin-dependent 3',5'-cyclic nucleotide phosphodiesterase 1C
Type:Enzyme
Mol. Mass.:80778.58
Organism:Homo sapiens (Human)
Description:Q14123
Residue:709
BDBM279101
NameBDBM279101
Synonyms:5-(2-ethoxy-3-pyridyl)-3-methyl-N-[(1-methylimidazol-4-yl)methyl]-1-[1-methylpropyl]pyrazolo[4,3-b]pyridin-7-amine,enantiomer 2 US10512632, Example 132 US10806718, Example 132 | US11634416, Example 132
TypeSmall organic molecule
Emp. Form.C23H29N7O
Mol. Mass.419.5227
SMILESCCOc1ncccc1-c1cc(NCc2cn(C)cn2)c2n(nc(C)c2n1)C(C)CC