Reaction Details
TargetNeprilysin
LigandBDBM299496
Substrate/Competitorn/a
Meas. Tech.Enzyme Inhibition Assay
Ki<1.00±n/a nM
Citation Fleury, MBeausoliel, AHughes, ADLong, DDWilton, DA Neprilysin inhibitors US Patent US9593110 Publication Date 3/14/2017
 
Neprilysin
Name:Neprilysin
Type:Enzyme
Mol. Mass.:85505.38
Organism:Homo sapiens (Human)
Description:P08473
Residue:750
BDBM299496
NameBDBM299496
Synonyms:(2S,4S)-5-(5′-Chloro-2′-fluorobiphenyl-4-yl)-2-ethoxymethyl-4-[(5-trifluoromethyl-1H-[1,2,4]triazole-3-carbonyl)amino]pentanoic Acid | US9593110, Example 6
TypeSmall organic molecule
Emp. Form.C26H27ClF4N4O4
Mol. Mass.570.964
SMILESCCOC[C@H](C[C@@H](Cc1ccc(cc1)-c1cc(Cl)ccc1F)NC(=O)c1n[nH]c(n1)C(F)(F)F)C(=O)OCC