Reaction Details
TargetNeprilysin
LigandBDBM299498
Substrate/Competitorn/a
Meas. Tech.Enzyme Inhibition Assay
Ki<1.00±n/a nM
Citation Fleury, MBeausoliel, AHughes, ADLong, DDWilton, DA Neprilysin inhibitors US Patent US9593110 Publication Date 3/14/2017
 
Neprilysin
Name:Neprilysin
Type:Enzyme
Mol. Mass.:85505.38
Organism:Homo sapiens (Human)
Description:P08473
Residue:750
BDBM299498
NameBDBM299498
Synonyms:(2R,4R)-5-(5′-Chloro-2′-fluorobiphenyl-4-yl)-2-(4-dimethylaminobutyrylamino)-4-[(1H-[1,2,3]triazole-4-carbonyl)amino]pentanoic Acid | US9593110, Example 73
TypeSmall organic molecule
Emp. Form.C26H30ClFN6O4
Mol. Mass.545.006
SMILESCN(C)CCCC(=O)N[C@H](C[C@@H](Cc1ccc(cc1)-c1cc(Cl)ccc1F)NC(=O)c1c[nH]nn1)C(O)=O