Reaction Details
TargetNeprilysin
LigandBDBM299633
Substrate/Competitorn/a
Meas. Tech.Enzyme Inhibition Assay
Ki<1.00±n/a nM
Citation Fleury, MBeausoliel, AHughes, ADLong, DDWilton, DA Neprilysin inhibitors US Patent US9593110 Publication Date 3/14/2017
 
Neprilysin
Name:Neprilysin
Type:Enzyme
Mol. Mass.:85505.38
Organism:Homo sapiens (Human)
Description:P08473
Residue:750
BDBM299633
NameBDBM299633
Synonyms:(2S,4S)-5-(3′-Chlorobiphenyl-4-yl)-2-ethoxymethyl-4-[(3-hydroxyisoxazole-5-carbonyl)amino]pentanoic Acid | US9593110, Example 8
TypeSmall organic molecule
Emp. Form.C26H29ClN2O6
Mol. Mass.500.971
SMILESCCOC[C@H](C[C@@H](Cc1ccc(cc1)-c1cccc(Cl)c1)NC(=O)c1cc(O)no1)C(=O)OCC