Reaction Details
TargetNeprilysin
LigandBDBM299634
Substrate/Competitorn/a
Meas. Tech.Enzyme Inhibition Assay
Ki<1.00±n/a nM
Citation Fleury, MBeausoliel, AHughes, ADLong, DDWilton, DA Neprilysin inhibitors US Patent US9593110 Publication Date 3/14/2017
 
Neprilysin
Name:Neprilysin
Type:Enzyme
Mol. Mass.:85505.38
Organism:Homo sapiens (Human)
Description:P08473
Residue:750
BDBM299634
NameBDBM299634
Synonyms:(2S,4S)-2-(Acetylaminomethyl)-5-(5′-chloro-2′-fluoro-biphenyl-4-yl)-4-[(1H-[1,2,3]triazole-4-carbonyl)amino]pentanoic Acid | US9593110, Example 28
TypeSmall organic molecule
Emp. Form.C23H23ClFN5O4
Mol. Mass.487.911
SMILESCC(=O)NC[C@H](C[C@@H](Cc1ccc(cc1)-c1cc(Cl)ccc1F)NC(=O)c1c[nH]nn1)C(O)=O