Reaction Details
TargetNeprilysin
LigandBDBM299685
Substrate/Competitorn/a
Meas. Tech.Enzyme Inhibition Assay
Ki<1.00±n/a nM
Citation Fleury, MBeausoliel, AHughes, ADLong, DDWilton, DA Neprilysin inhibitors US Patent US9593110 Publication Date 3/14/2017
 
Neprilysin
Name:Neprilysin
Type:Enzyme
Mol. Mass.:85505.38
Organism:Homo sapiens (Human)
Description:P08473
Residue:750
BDBM299685
NameBDBM299685
Synonyms:(2S,4S)-2-(1-Amino-1-methylethyl)-5-(5′-chloro-2′-fluorobiphenyl-4-yl)-4-[(3H-[1,2,3]triazole-4-carbonyl)amino]pentanoic Acid | US9593110, Example 104
TypeSmall organic molecule
Emp. Form.C23H25ClFN5O3
Mol. Mass.473.928
SMILESCC(C)(N)[C@H](C[C@@H](Cc1ccc(cc1)-c1cc(Cl)ccc1F)NC(=O)c1cnn[nH]1)C(O)=O