Reaction Details
TargetNeprilysin
LigandBDBM300258
Substrate/Competitorn/a
Meas. Tech.Enzyme Inhibition Assay
Ki<1.00±n/a nM
Citation Fleury, MBeausoliel, AHughes, ADLong, DDWilton, DA Neprilysin inhibitors US Patent US9593110 Publication Date 3/14/2017
 
Neprilysin
Name:Neprilysin
Type:Enzyme
Mol. Mass.:85505.38
Organism:Homo sapiens (Human)
Description:P08473
Residue:750
BDBM300258
NameBDBM300258
Synonyms:US9593110, 18-3
TypeSmall Organic Molecule
Emp. Form.C22H20Cl2FN3O4
Mol. Mass.480.316
SMILESCc1cnc(o1)C(=O)N[C@@H](C[C@@H](N)C(O)=O)Cc1ccc(cc1Cl)-c1cc(Cl)ccc1F