Reaction Details
TargetNeprilysin
LigandBDBM300266
Substrate/Competitorn/a
Meas. Tech.Enzyme Inhibition Assay
Ki<1.00±n/a nM
Citation Fleury, MBeausoliel, AHughes, ADLong, DDWilton, DA Neprilysin inhibitors US Patent US9593110 Publication Date 3/14/2017
 
Neprilysin
Name:Neprilysin
Type:Enzyme
Mol. Mass.:85505.38
Organism:Homo sapiens (Human)
Description:P08473
Residue:750
BDBM300266
NameBDBM300266
Synonyms:US9593110, 2-8
TypeSmall Organic Molecule
Emp. Form.C23H22ClFN2O5
Mol. Mass.460.883
SMILESCOC[C@H](C[C@@H](Cc1ccc(cc1)-c1cc(Cl)ccc1F)NC(=O)c1cocn1)C(O)=O