Reaction Details
TargetNeprilysin
LigandBDBM300281
Substrate/Competitorn/a
Meas. Tech.Enzyme Inhibition Assay
Ki<1.00±n/a nM
Citation Fleury, MBeausoliel, AHughes, ADLong, DDWilton, DA Neprilysin inhibitors US Patent US9593110 Publication Date 3/14/2017
 
Neprilysin
Name:Neprilysin
Type:Enzyme
Mol. Mass.:85505.38
Organism:Homo sapiens (Human)
Description:P08473
Residue:750
BDBM300281
NameBDBM300281
Synonyms:US9593110, 2-15
TypeSmall Organic Molecule
Emp. Form.C24H24ClFN2O5
Mol. Mass.474.909
SMILESCOC[C@H](C[C@@H](Cc1ccc(cc1)-c1cc(Cl)ccc1F)NC(=O)c1ncc(C)o1)C(O)=O