Reaction Details
TargetNeprilysin
LigandBDBM300307
Substrate/Competitorn/a
Meas. Tech.Enzyme Inhibition Assay
Ki<1.00±n/a nM
Citation Fleury, MBeausoliel, AHughes, ADLong, DDWilton, DA Neprilysin inhibitors US Patent US9593110 Publication Date 3/14/2017
 
Neprilysin
Name:Neprilysin
Type:Enzyme
Mol. Mass.:85505.38
Organism:Homo sapiens (Human)
Description:P08473
Residue:750
BDBM300307
NameBDBM300307
Synonyms:US9593110, 9-1
TypeSmall Organic Molecule
Emp. Form.C23H25ClN4O4
Mol. Mass.456.922
SMILESCCOC[C@H](C[C@@H](Cc1ccc(cc1)-c1cccc(Cl)c1)NC(=O)c1c[nH]nn1)C(O)=O