Reaction Details
TargetTyrosine-protein kinase receptor UFO
LigandBDBM299749
Substrate/Competitorn/a
Meas. Tech.Enzyme Assay
Ki 0.010±n/a nM
Citation Johnson, TWRichardson, PFCollins, MRRichter, DTBurke, BJNinkovic, SGajiwala, KSLinton, MALe, PTHoffman, JE Axl inhibitors US Patent US9593097 Publication Date 3/14/2017
 
Tyrosine-protein kinase receptor UFO
Name:Tyrosine-protein kinase receptor UFO
Type:Enzyme
Mol. Mass.:98316.97
Organism:Homo sapiens (Human)
Description:P30530
Residue:894
BDBM299749
NameBDBM299749
Synonyms:4-[4-({[2-amino-5- (1-methyl-1H- imidazol-4- yl)pyridin-3- yl]oxy}methyl) piperidin-1-yl]-N- (bicyclo[1.1.1]pent- 1-yl)-6-[(1- cyanocyclopropyl) methoxy]-1,3,5- triazine-2- carboxamide | US9593097, Example 117
TypeSmall organic molecule
Emp. Form.C29H34N10O3
Mol. Mass.570.6455
SMILESCn1cnc(c1)-c1cnc(N)c(OCC2CCN(CC2)c2nc(OCC3(CC3)C#N)nc(n2)C(=O)NC23CC(C2)C3)c1