Reaction Details
TargetTyrosine-protein kinase receptor UFO
LigandBDBM299876
Substrate/Competitorn/a
Meas. Tech.Enzyme Assay
Ki 0.040±n/a nM
Citation Johnson, TWRichardson, PFCollins, MRRichter, DTBurke, BJNinkovic, SGajiwala, KSLinton, MALe, PTHoffman, JE Axl inhibitors US Patent US9593097 Publication Date 3/14/2017
 
Tyrosine-protein kinase receptor UFO
Name:Tyrosine-protein kinase receptor UFO
Type:Enzyme
Mol. Mass.:98316.97
Organism:Homo sapiens (Human)
Description:P30530
Residue:894
BDBM299876
NameBDBM299876
Synonyms:4-[4-({[2-amino-5- (1-methyl-1H- imidazol-4- yl)pyridin-3- yl]oxy}methyl) piperidin-1- yl]-6-[(1- cyanocyclopropyl) methoxy]-N-(3,3- difluorobutan-2- yl)-1,3,5-triazine- 2-carboxamide | US9593097, Example 246
TypeSmall organic molecule
Emp. Form.C28H34F2N10O3
Mol. Mass.596.6316
SMILESCC(NC(=O)c1nc(OCC2(CC2)C#N)nc(n1)N1CCC(COc2cc(cnc2N)-c2cn(C)cn2)CC1)C(C)(F)F