Reaction Details
TargetTyrosine-protein kinase receptor UFO
LigandBDBM299901
Substrate/Competitorn/a
Meas. Tech.Enzyme Assay
Ki 0.021±n/a nM
Citation Johnson, TWRichardson, PFCollins, MRRichter, DTBurke, BJNinkovic, SGajiwala, KSLinton, MALe, PTHoffman, JE Axl inhibitors US Patent US9593097 Publication Date 3/14/2017
 
Tyrosine-protein kinase receptor UFO
Name:Tyrosine-protein kinase receptor UFO
Type:Enzyme
Mol. Mass.:98316.97
Organism:Homo sapiens (Human)
Description:P30530
Residue:894
BDBM299901
NameBDBM299901
Synonyms:4-[4-({[2-amino-5- (1-methyl-1H- imidazol-4- yl)pyridin-3- yl]oxy}methyl) piperidin-1- yl]-N-tert- butyl-6-{[(1S,2R)- 2- cyanocyclopropyl] methoxy}-1,3,5- triazine-2- carboxamide | US9593097, Example 271
TypeSmall organic molecule
Emp. Form.C28H36N10O3
Mol. Mass.560.6506
SMILESCn1cnc(c1)-c1cnc(N)c(OCC2CCN(CC2)c2nc(OC[C@H]3C[C@H]3C#N)nc(n2)C(=O)NC(C)(C)C)c1