Reaction Details
TargetTyrosine-protein kinase receptor UFO
LigandBDBM299909
Substrate/Competitorn/a
Meas. Tech.Enzyme Assay
Ki 0.016±n/a nM
Citation Johnson, TWRichardson, PFCollins, MRRichter, DTBurke, BJNinkovic, SGajiwala, KSLinton, MALe, PTHoffman, JE Axl inhibitors US Patent US9593097 Publication Date 3/14/2017
 
Tyrosine-protein kinase receptor UFO
Name:Tyrosine-protein kinase receptor UFO
Type:Enzyme
Mol. Mass.:98316.97
Organism:Homo sapiens (Human)
Description:P30530
Residue:894
BDBM299909
NameBDBM299909
Synonyms:4-[4-({[2-amino-5- (1-methyl-1H- imidazol-4- yl)pyridin-3- yl]oxy}methyl) piperidin-1-yl]- 6-[(2R)- tetrahydrofuran-2- ylmethoxy]-N- [(2S)-1,1,1- trifluoropropan-2- yl]-1,3,5-triazine- 2-carboxamide | US9593097, Example 279
TypeSmall organic molecule
Emp. Form.C27H34F3N9O4
Mol. Mass.605.612
SMILESC[C@H](NC(=O)c1nc(OC[C@H]2CCCO2)nc(n1)N1CCC(COc2cc(cnc2N)-c2cn(C)cn2)CC1)C(F)(F)F