Reaction Details
TargetTyrosine-protein kinase receptor UFO
LigandBDBM299922
Substrate/Competitorn/a
Meas. Tech.Enzyme Assay
Ki 0.033±n/a nM
Citation Johnson, TWRichardson, PFCollins, MRRichter, DTBurke, BJNinkovic, SGajiwala, KSLinton, MALe, PTHoffman, JE Axl inhibitors US Patent US9593097 Publication Date 3/14/2017
 
Tyrosine-protein kinase receptor UFO
Name:Tyrosine-protein kinase receptor UFO
Type:Enzyme
Mol. Mass.:98316.97
Organism:Homo sapiens (Human)
Description:P30530
Residue:894
BDBM299922
NameBDBM299922
Synonyms:6-[4-({[2-amino-5- (1-methyl-1H- imidazol-4- yl)pyridin-3- yl]oxy}methyl) piperidin-1-yl]-2- {[(1S)-2,2- difluoro- cyclopropyl] methoxy}-N- [(2R)-1- hydroxypropan-2- yl]pyrimidine-4- carboxamide | US9593097, Example 292
TypeSmall organic molecule
Emp. Form.C27H34F2N8O4
Mol. Mass.572.6069
SMILESC[C@H](CO)NC(=O)c1cc(nc(OC[C@@H]2CC2(F)F)n1)N1CCC(COc2cc(cnc2N)-c2cn(C)cn2)CC1