Reaction Details
TargetTyrosine-protein kinase receptor UFO
LigandBDBM300103
Substrate/Competitorn/a
Meas. Tech.Enzyme Assay
Ki 0.030±n/a nM
Citation Johnson, TWRichardson, PFCollins, MRRichter, DTBurke, BJNinkovic, SGajiwala, KSLinton, MALe, PTHoffman, JE Axl inhibitors US Patent US9593097 Publication Date 3/14/2017
 
Tyrosine-protein kinase receptor UFO
Name:Tyrosine-protein kinase receptor UFO
Type:Enzyme
Mol. Mass.:98316.97
Organism:Homo sapiens (Human)
Description:P30530
Residue:894
BDBM300103
NameBDBM300103
Synonyms:4-[(1- cyanocyclopropyl) methoxy]-N-[(2R)- 1-hydroxypropan- 2-yl]-6-[4-(4- methoxy-1H- pyrrolo[2,3- b]pyridin-3- yl)piperidin-1-yl]- 1,3,5-triazine-2- carboxamide | US9593097, Example 484
TypeSmall organic molecule
Emp. Form.C25H30N8O4
Mol. Mass.506.5569
SMILESCOc1ccnc2[nH]cc(C3CCN(CC3)c3nc(OCC4(CC4)C#N)nc(n3)C(=O)N[C@H](C)CO)c12