Reaction Details
TargetTyrosine-protein kinase receptor UFO
LigandBDBM300107
Substrate/Competitorn/a
Meas. Tech.Enzyme Assay
Ki 0.042±n/a nM
Citation Johnson, TWRichardson, PFCollins, MRRichter, DTBurke, BJNinkovic, SGajiwala, KSLinton, MALe, PTHoffman, JE Axl inhibitors US Patent US9593097 Publication Date 3/14/2017
 
Tyrosine-protein kinase receptor UFO
Name:Tyrosine-protein kinase receptor UFO
Type:Enzyme
Mol. Mass.:98316.97
Organism:Homo sapiens (Human)
Description:P30530
Residue:894
BDBM300107
NameBDBM300107
Synonyms:N-[(1R,2S)-2- hydroxycyclobutyl]- 6-[4-(4-methoxy- 1H-pyrazolo[3,4- b]pyridin-3- yl)piperidin- 1-yl]-2-[(2R- tetrahydrofuran-2- ylmethoxy] pyrimidine- 4-carboxamide | US9593097, Example 488
TypeSmall organic molecule
Emp. Form.C26H33N7O5
Mol. Mass.523.5841
SMILESCOc1ccnc2[nH]nc(C3CCN(CC3)c3cc(nc(OC[C@H]4CCCO4)n3)C(=O)N[C@@H]3CC[C@@H]3O)c12