Reaction Details
TargetTyrosine-protein kinase receptor UFO
LigandBDBM300125
Substrate/Competitorn/a
Meas. Tech.Enzyme Assay
Ki 0.021±n/a nM
Citation Johnson, TWRichardson, PFCollins, MRRichter, DTBurke, BJNinkovic, SGajiwala, KSLinton, MALe, PTHoffman, JE Axl inhibitors US Patent US9593097 Publication Date 3/14/2017
 
Tyrosine-protein kinase receptor UFO
Name:Tyrosine-protein kinase receptor UFO
Type:Enzyme
Mol. Mass.:98316.97
Organism:Homo sapiens (Human)
Description:P30530
Residue:894
BDBM300125
NameBDBM300125
Synonyms:N-cyclobutyl-4- {[(2R)-1- methoxypropan-2- yl]oxy}-6-[4-(4- methoxy-1H- pyrazolo[3,4- b]pyridin-3- yl)piperidin-1-yl]- 1,3,5-triazine-2- carboxamide | US9593097, Example 506
TypeSmall organic molecule
Emp. Form.C24H32N8O4
Mol. Mass.496.5621
SMILESCOC[C@@H](C)Oc1nc(nc(n1)C(=O)NC1CCC1)N1CCC(CC1)c1n[nH]c2nccc(OC)c12