Reaction Details
TargetN-formyl peptide receptor 2
LigandBDBM350655
Substrate/Competitorn/a
Meas. Tech.FLIPR
EC50 0.270±n/a nM
Citation Viswanath, VBeard, RLDonello, JEHsia, E Use of agonists of formyl peptide receptor 2 for treating dermatological diseases US Patent US10799518 Publication Date 10/13/2020
 
N-formyl peptide receptor 2
Name:N-formyl peptide receptor 2
Type:G Protein-Coupled Receptor (GPCR)
Mol. Mass.:38968.35
Organism:Homo sapiens (Human)
Description:P25090
Residue:351
BDBM350655
NameBDBM350655
Synonyms:US10208071, Compound 117 US10799518, Compound 117 | diethyl ({[(2S)-2-{[(4- bromophenyl)carbamoyl]amino} pentanoyl]amino}methyl) phosphonate
TypeSmall organic molecule
Emp. Form.C17H27BrN3O5P
Mol. Mass.464.291
SMILESCCC[C@H](NC(=O)Nc1ccc(Br)cc1)C(=O)NCP(=O)(OCC)OCC