Reaction Details
TargetDual specificity calcium/calmodulin-dependent 3',5'-cyclic nucleotide phosphodiesterase 1B
LigandBDBM279047
Substrate/Competitorn/a
Meas. Tech.PDE1 Inhibition Assay
IC50 0.220±n/a nM
Citation Kehler, JJuhl, KMarigo, MVital, PJJessing, MLanggård, MRasmussen, LKClementson, CM 1H-pyrazolo[4,3-b]pyridines as PDE1 inhibitors US Patent US10806718 Publication Date 10/20/2020
 
Dual specificity calcium/calmodulin-dependent 3',5'-cyclic nucleotide phosphodiesterase 1B
Name:Dual specificity calcium/calmodulin-dependent 3',5'-cyclic nucleotide phosphodiesterase 1B
Type:Enzyme
Mol. Mass.:61366.51
Organism:Homo sapiens (Human)
Description:n/a
Residue:536
BDBM279047
NameBDBM279047
Synonyms:5-(2-ethoxy-3-pyridyl)-1-isopropyl-3-methyl-N-[[2-(trifluoromethyl)-3-pyridyl]methyl]pyrazolo[4,3-b]pyridin-7-amine US10512632, Example 77 US10806718, Example 77 US11491140, Example 77 | US11634416, Example 77
TypeSmall organic molecule
Emp. Form.C24H25F3N6O
Mol. Mass.470.4901
SMILESCCOc1ncccc1-c1cc(NCc2cccnc2C(F)(F)F)c2n(nc(C)c2n1)C(C)C