Reaction Details
TargetDual specificity calcium/calmodulin-dependent 3',5'-cyclic nucleotide phosphodiesterase 1B
LigandBDBM279101
Substrate/Competitorn/a
Meas. Tech.PDE1 Inhibition Assay
IC50 0.045±n/a nM
Citation Kehler, JJuhl, KMarigo, MVital, PJJessing, MLanggård, MRasmussen, LKClementson, CM 1H-pyrazolo[4,3-b]pyridines as PDE1 inhibitors US Patent US10806718 Publication Date 10/20/2020
 
Dual specificity calcium/calmodulin-dependent 3',5'-cyclic nucleotide phosphodiesterase 1B
Name:Dual specificity calcium/calmodulin-dependent 3',5'-cyclic nucleotide phosphodiesterase 1B
Type:Enzyme
Mol. Mass.:61366.51
Organism:Homo sapiens (Human)
Description:n/a
Residue:536
BDBM279101
NameBDBM279101
Synonyms:5-(2-ethoxy-3-pyridyl)-3-methyl-N-[(1-methylimidazol-4-yl)methyl]-1-[1-methylpropyl]pyrazolo[4,3-b]pyridin-7-amine,enantiomer 2 US10512632, Example 132 US10806718, Example 132 | US11634416, Example 132
TypeSmall organic molecule
Emp. Form.C23H29N7O
Mol. Mass.419.5227
SMILESCCOc1ncccc1-c1cc(NCc2cn(C)cn2)c2n(nc(C)c2n1)C(C)CC