Reaction Details
TargetHistone deacetylase 1
LigandBDBM163633
Substrate/Competitorn/a
Meas. Tech.HDAC Inhibition
IC50 8810±n/a nM
Citation Liao, DRoush, WRStowe, RL HDAC inhibitor compounds and methods of treatment US Patent US10807944 Publication Date 10/20/2020
 
Histone deacetylase 1
Name:Histone deacetylase 1
Type:Enzyme
Mol. Mass.:55090.27
Organism:Homo sapiens (Human)
Description:Q13547
Residue:482
BDBM163633
NameBDBM163633
Synonyms:SR-3364 US11731934, Compound RLS2-256
TypeSmall organic molecule
Emp. Form.C13H17BrN2O
Mol. Mass.297.191
SMILESBrc1ccc(cc1)C(=O)NNCC1CCCC1