Reaction Details
TargetFibroblast growth factor receptor 2
LigandBDBM472833
Substrate/Competitorn/a
Meas. Tech.Measurement of Inhibitory Effect on FGFR2 Kinase Activity
IC50 0.400±n/a nM
Citation Sootome, H Therapeutic agent for FGFR inhibitor-resistant cancer US Patent US10835536 Publication Date 11/17/2020
 
Fibroblast growth factor receptor 2
Name:Fibroblast growth factor receptor 2
Type:Enzyme
Mol. Mass.:92015.45
Organism:Homo sapiens (Human)
Description:P21802
Residue:821
BDBM472833
NameBDBM472833
Synonyms:US10835536, Ex. Comp 39
TypeSmall organic molecule
Emp. Form.C23H25N5O3
Mol. Mass.419.4763
SMILESCOc1cc(OC)cc(c1)C#CC1=CN([C@H]2CCN(C2)C(=O)C=C)C2N=CN=C(N)C12