Reaction Details
TargetFibroblast growth factor receptor 2
LigandBDBM161438
Substrate/Competitorn/a
Meas. Tech.Measurement of Inhibitory Effect on FGFR2 Kinase Activity
IC50<0.300±n/a nM
Citation Sootome, H Therapeutic agent for FGFR inhibitor-resistant cancer US Patent US10835536 Publication Date 11/17/2020
 
Fibroblast growth factor receptor 2
Name:Fibroblast growth factor receptor 2
Type:Enzyme
Mol. Mass.:92015.45
Organism:Homo sapiens (Human)
Description:P21802
Residue:821
BDBM161438
NameBDBM161438
Synonyms:US10124003, Ex. Compound 51 US9108973, 51
TypeSmall organic molecule
Emp. Form.C22H23N5O3
Mol. Mass.405.4497
SMILESCOc1cc(OC)cc(c1)C#CC1=CN(C2CN(C2)C(=O)C=C)C2N=CN=C(N)C12