Reaction Details
TargetFibroblast growth factor receptor 2
LigandBDBM161453
Substrate/Competitorn/a
Meas. Tech.Measurement of Inhibitory Effect on FGFR2 Kinase Activity
IC50<0.300±n/a nM
Citation Sootome, H Therapeutic agent for FGFR inhibitor-resistant cancer US Patent US10835536 Publication Date 11/17/2020
 
Fibroblast growth factor receptor 2
Name:Fibroblast growth factor receptor 2
Type:Enzyme
Mol. Mass.:92015.45
Organism:Homo sapiens (Human)
Description:P21802
Residue:821
BDBM161453
NameBDBM161453
Synonyms:US10124003, Ex. Compound 66 US9108973, 66
TypeSmall organic molecule
Emp. Form.C25H25N5O5
Mol. Mass.475.4965
SMILESCOC(=O)[C@@H]1C[C@@H](CN1C(=O)C=C)n1cc(C#Cc2cc(OC)cc(OC)c2)c2c(N)ncnc12