Reaction Details
TargetPhosphatidylinositol 4,5-bisphosphate 3-kinase catalytic subunit gamma isoform
LigandBDBM295676
Substrate/Competitorn/a
Meas. Tech.Biochemical Inhibition Assay
Ki 2.50±n/a nM
Citation Braun, MHanan, EStaben, STHeald, RAMacleod, CElliott, R Benzoxazepin oxazolidinone compounds and methods of use US Patent US10851091 Publication Date 12/1/2020
 
Phosphatidylinositol 4,5-bisphosphate 3-kinase catalytic subunit gamma isoform
Name:Phosphatidylinositol 4,5-bisphosphate 3-kinase catalytic subunit gamma isoform
Type:Enzyme Subunit
Mol. Mass.:126470.30
Organism:Homo sapiens (Human)
Description:P48736
Residue:1102
BDBM295676
NameBDBM295676
Synonyms:US10851091, U.S. Pat. No. 8,242,104 No. 486 | US8242104, Compound 486
TypeSmall organic molecule
Emp. Form.C18H17F3N6O3
Mol. Mass.422.3612
SMILESC[C@H](Oc1ccc2-c3nc(cn3CCOc2c1)-c1ncnn1CC(F)(F)F)C(N)=O