Reaction Details
TargetReceptor-interacting serine/threonine-protein kinase 2
LigandBDBM372155
Substrate/Competitorn/a
Meas. Tech.RIPK2 Inhibition Assay
IC50<100±n/a nM
Citation Laufer, RNg, GBrokx, RPauls, HWLi, SMason, JMBray, MR RIPK2 inhibitors and method of treating cancer with same US Patent US10875863 Publication Date 12/29/2020
 
Receptor-interacting serine/threonine-protein kinase 2
Name:Receptor-interacting serine/threonine-protein kinase 2
Type:Protein
Mol. Mass.:61201.30
Organism:Homo sapiens (Human)
Description:n/a
Residue:540
BDBM372155
NameBDBM372155
Synonyms:N-(4- morpholino- phenyl)-6- (o-tolyl)-5H- pyrrolo[3,2- d]pyrimidin-2- amine US10875863, Example A8
TypeSmall organic molecule
Emp. Form.C23H23N5O
Mol. Mass.385.4616
SMILESCc1ccccc1-c1cc2nc(Nc3ccc(cc3)N3CCOCC3)ncc2[nH]1