Reaction Details
TargetReplicase polyprotein 1ab
LigandBDBM476979
Substrate/Competitorn/a
Meas. Tech.Literature assay
IC50 7.00±n/a nM
Citation Vankadara, SWong, YXLiu, BSee, YYTan, LHTan, QWWang, GKaruna, RGuo, XTan, STFong, JYJoy, JChia, CSB A head-to-head comparison of the inhibitory activities of 15 peptidomimetic SARS-CoV-2 3CLpro inhibitors. Bioorg Med Chem Lett48:128263 (2021) 
 
Replicase polyprotein 1ab
Name:Replicase polyprotein 1ab
Type:Protein
Mol. Mass.:790250.81
Organism:Human SARS coronavirus (SARS-CoV) (Severe acute respiratory syndrome coronavirus)
Description:P0C6X7
Residue:7073
BDBM476979
NameBDBM476979
Synonyms:peptidomimetic coronavirus 3CLpro inhibitors 17
TypeSmall organic molecule
Emp. Form.C29H43N5O7
Mol. Mass.573.681
SMILESCC(C)C[C@H](NC(=O)[C@@H](NC(=O)OCc1ccccc1)C(C)C)C(=O)N[C@@H](C[C@@H]1CCNC1=O)C(=O)C(=O)N(C)C