Reaction Details
TargetReplicase polyprotein 1ab
LigandBDBM476989
Substrate/Competitorn/a
Meas. Tech.fluorescence resonance energy transfer (FRET)-based CoV-2 3CLpro inhibition assay
IC50 9.00±1.00 nM
Citation Vankadara, SWong, YXLiu, BSee, YYTan, LHTan, QWWang, GKaruna, RGuo, XTan, STFong, JYJoy, JChia, CSB A head-to-head comparison of the inhibitory activities of 15 peptidomimetic SARS-CoV-2 3CLpro inhibitors. Bioorg Med Chem Lett48:128263 (2021) 
 
Replicase polyprotein 1ab
Name:Replicase polyprotein 1ab
Type:Protein
Mol. Mass.:790250.81
Organism:Human SARS coronavirus (SARS-CoV) (Severe acute respiratory syndrome coronavirus)
Description:P0C6X7
Residue:7073
BDBM476989
NameBDBM476989
Synonyms:TG-0205221
TypeSmall organic molecule
Emp. Form.C32H48N4O7
Mol. Mass.600.7461
SMILESCC(OC(C)(C)C)[C@H](NC(=O)OCc1ccccc1)C(=O)N[C@@H](CC1CCCCC1)C(=O)N[C@@H](CC1CCNC1=O)C=O