Reaction Details
TargetTyrosine-protein kinase ABL2
LigandBDBM481107
Substrate/Competitorn/a
Meas. Tech.Kinase Assay
IC50 67.0±n/a nM
Citation Werner, MHKelly, TA Compositions and methods for inhibiting kinases US Patent US10906896 Publication Date 2/2/2021
 
Tyrosine-protein kinase ABL2
Name:Tyrosine-protein kinase ABL2
Type:PROTEIN
Mol. Mass.:128360.63
Organism:Homo sapiens (Human)
Description:ChEMBL_325082
Residue:1182
BDBM481107
NameBDBM481107
Synonyms:US10906896, Cpd 107
TypeSmall organic molecule
Emp. Form.C36H36N12O2
Mol. Mass.668.7502
SMILESCN1CCN(Cc2ccc(cc2)C(=O)Nc2ccc(C)c(Nc3nccc(n3)-c3cncc(c3)C3=NN=C(C3)C(=O)Nc3ccn[nH]3)c2)CC1