Reaction Details
TargetTyrosine-protein kinase ABL2
LigandBDBM481108
Substrate/Competitorn/a
Meas. Tech.Kinase Assay
IC50 85.9±n/a nM
Citation Werner, MHKelly, TA Compositions and methods for inhibiting kinases US Patent US10906896 Publication Date 2/2/2021
 
Tyrosine-protein kinase ABL2
Name:Tyrosine-protein kinase ABL2
Type:PROTEIN
Mol. Mass.:128360.63
Organism:Homo sapiens (Human)
Description:ChEMBL_325082
Residue:1182
BDBM481108
NameBDBM481108
Synonyms:US10906896, Cpd 108
TypeSmall organic molecule
Emp. Form.C37H38N12O2
Mol. Mass.682.7768
SMILESCN1CCN(Cc2ccc(cc2)C(=O)Nc2ccc(C)c(Nc3nccc(n3)-c3cncc(c3)C3=NN=C(C3)C(=O)Nc3[nH]ncc3C)c2)CC1