Reaction Details
TargetTyrosine-protein kinase ABL2
LigandBDBM481113
Substrate/Competitorn/a
Meas. Tech.Kinase Assay
IC50 35.0±n/a nM
Citation Werner, MHKelly, TA Compositions and methods for inhibiting kinases US Patent US10906896 Publication Date 2/2/2021
 
Tyrosine-protein kinase ABL2
Name:Tyrosine-protein kinase ABL2
Type:PROTEIN
Mol. Mass.:128360.63
Organism:Homo sapiens (Human)
Description:ChEMBL_325082
Residue:1182
BDBM481113
NameBDBM481113
Synonyms:US10906896, Cpd 117
TypeSmall organic molecule
Emp. Form.C39H41N13O3
Mol. Mass.739.8281
SMILESCN(C)C(=O)c1cc(NC(=O)C2=NN=C(C2)c2cncc(c2)-c2ccnc(Nc3cc(NC(=O)c4ccc(CN5CCN(C)CC5)cc4)ccc3C)n2)[nH]n1