Reaction Details
TargetEstrogen receptor
LigandBDBM300961
Substrate/Competitorn/a
Meas. Tech.MCF-7 ER Down-Regulation Assay
IC50 0.050±n/a nM
Citation Barlaam, BCO Donovan, DHHughes, SJMoss, TANissink, JWScott, JSYang, B Chemical compounds US Patent US10131663 Publication Date 11/20/2018
 
Estrogen receptor
Name:Estrogen receptor
Type:Protein
Mol. Mass.:66230.44
Organism:Homo sapiens (Human)
Description:P03372
Residue:595
BDBM300961
NameBDBM300961
Synonyms:1-(3-Fluoropropyl)-N-(4-((6R,8R)-8-methyl-7-(2,2,2-trifluoroethyl)-6,7,8,9-tetrahydro-3H-pyrazolo[4,3-f]isoquinolin-6-yl)phenyl)azetidin-3-amine US10590130, Example 27 | US10961241, Example 27
TypeSmall organic molecule
Emp. Form.C25H29F4N5
Mol. Mass.475.5249
SMILESC[C@@H]1Cc2c(ccc3[nH]ncc23)[C@H](N1CC(F)(F)F)c1ccc(NC2CN(CCCF)C2)cc1