Reaction Details
TargetEstrogen receptor
LigandBDBM300962
Substrate/Competitorn/a
Meas. Tech.MCF-7 ER Down-Regulation Assay
IC50 0.065±n/a nM
Citation Barlaam, BCO Donovan, DHHughes, SJMoss, TANissink, JWScott, JSYang, B Chemical compounds US Patent US10131663 Publication Date 11/20/2018
 
Estrogen receptor
Name:Estrogen receptor
Type:Protein
Mol. Mass.:66230.44
Organism:Homo sapiens (Human)
Description:P03372
Residue:595
BDBM300962
NameBDBM300962
Synonyms:1-(3-fluoropropyl)-N-(3-methoxy-4-((6S,8R)-8-methyl-7-(2,2,2-trifluoroethyl)-6,7,8,9-tetrahydro-3H-pyrazolo[4,3-f]isoquinolin-6-yl)phenyl)azetidin-3-amine US10590130, Example 28 | US10961241, Example 28
TypeSmall organic molecule
Emp. Form.C26H31F4N5O
Mol. Mass.505.5509
SMILESCOc1cc(NC2CN(CCCF)C2)ccc1[C@H]1N(CC(F)(F)F)[C@H](C)Cc2c1ccc1[nH]ncc21