Reaction Details
TargetEstrogen receptor
LigandBDBM300966
Substrate/Competitorn/a
Meas. Tech.MCF-7 ER Down-Regulation Assay
IC50 0.096±n/a nM
Citation Barlaam, BCO Donovan, DHHughes, SJMoss, TANissink, JWScott, JSYang, B Chemical compounds US Patent US10131663 Publication Date 11/20/2018
 
Estrogen receptor
Name:Estrogen receptor
Type:Protein
Mol. Mass.:66230.44
Organism:Homo sapiens (Human)
Description:P03372
Residue:595
BDBM300966
NameBDBM300966
Synonyms:6-((6S,8R)-1-fluoro-8-methyl-7-(2,2,2-trifluoroethyl)-6,7,9,8-tetrahydro-3H-pyrazolo[4,3-f]isoquin-6-yl)-N-(3-fluoropropyl)azetidi-3-yl)pyridin-3-amine US10961241, Example 32
TypeSmall organic molecule
Emp. Form.C24H27F5N6
Mol. Mass.494.5034
SMILESC[C@@H]1Cc2c(ccc3[nH]nc(F)c23)[C@H](N1CC(F)(F)F)c1ccc(NC2CN(CCCF)C2)cn1